{"text_format":"1","workbook":"xlsx","n_sheets":3,"sheets":["Sheet1","Remarque importante","Actes"],"not_rendered":{"charts":0,"images":0,"macros":1,"external_links":0,"defined_names":0,"comments":0,"pivot_tables":0},"unopened":[],"bounds":{"document_bytes":16777216,"sheet_cells":100000,"rows_first":2000,"rows_last":500,"rows_between":2000,"halvings":0,"cell_chars":16384,"cell_head_chars":4096},"cells_cut":0,"cells_raw":0,"read":"whole","date_system":"1900"}

{"sheet":"Sheet1","index":0,"n_rows":47,"n_cols":12,"rows_kept":47,"cut":false,"hidden":false,"merged":[[24,5,24,8],[25,5,25,8],[26,5,26,8],[45,1,45,11],[29,9,29,10],[0,8,1,11],[2,6,6,11],[46,1,47,11],[0,1,0,5],[10,7,10,10],[11,7,11,10],[12,7,12,10],[13,7,13,10],[0,6,1,7],[12,3,12,5],[13,3,13,5],[15,1,15,5],[15,9,15,10],[27,4,29,6],[28,9,28,10],[10,1,10,2],[11,1,11,2],[12,1,12,2],[13,1,13,2],[10,3,10,5],[11,3,11,5],[21,5,21,8],[22,5,22,8],[30,1,40,11],[14,8,14,10],[14,3,14,4],[27,1,27,2],[28,1,29,3],[27,7,27,8],[28,7,28,8],[29,7,29,8],[16,5,16,8],[17,5,17,8],[18,5,18,8],[19,5,19,8],[20,5,20,8],[23,5,23,8]]}
[null,"<NOM-PSY> <Prénom-psy>",null,null,null,null,"Code psychothérapeute :"]
[]
[null,null,null,null,null,null,"<réservé CNS> "]
[]
[]
[]
[]
[null,"Tél :"]
[null,"Fax : "]
[null,"Email :"]
[null,"Matricule :   "]
[null,"Patient :      "]
[null,"N° Accident :   "]
[null,"Date Accident :"]
[null,"Prescripteur :",null,90,null,null,"Date ordonnance :"]
[null,"MÉMOIRE D’HONORAIRES    N° : ",null,null,null,null,null,null,"du"]
[null,"Exécutant","Lieu","Date","Code Acte","Libellé",null,null,null,"Montant","Part.pers.*"]
["01",null,null,null,null,{"$f":"IF(E18=\"\",\"\",VLOOKUP(E18,Actes!$A$2:$B$4,2,FALSE))","v":""},null,null,null,null,null,"€"]
["02",null,null,null,null,{"$f":"IF(E19=\"\",\"\",VLOOKUP(E19,Actes!$A$2:$B$4,2,FALSE))","v":""},null,null,null,null,null,"€"]
["03",null,null,null,null,{"$f":"IF(E20=\"\",\"\",VLOOKUP(E20,Actes!$A$2:$B$4,2,FALSE))","v":""},null,null,null,null,null,"€"]
["04",null,null,null,null,{"$f":"IF(E21=\"\",\"\",VLOOKUP(E21,Actes!$A$2:$B$4,2,FALSE))","v":""},null,null,null,null,null,"€"]
["05",null,null,null,null,{"$f":"IF(E22=\"\",\"\",VLOOKUP(E22,Actes!$A$2:$B$4,2,FALSE))","v":""},null,null,null,null,null,"€"]
["06",null,null,null,null,{"$f":"IF(E23=\"\",\"\",VLOOKUP(E23,Actes!$A$2:$B$4,2,FALSE))","v":""},null,null,null,null,null,"€"]
["07",null,null,null,null,{"$f":"IF(E24=\"\",\"\",VLOOKUP(E24,Actes!$A$2:$B$4,2,FALSE))","v":""},null,null,null,null,null,"€"]
["08",null,null,null,null,{"$f":"IF(E25=\"\",\"\",VLOOKUP(E25,Actes!$A$2:$B$4,2,FALSE))","v":""},null,null,null,null,null,"€"]
["09",null,null,null,null,{"$f":"IF(E26=\"\",\"\",VLOOKUP(E26,Actes!$A$2:$B$4,2,FALSE))","v":""},null,null,null,null,null,"€"]
["10",null,null,null,null,{"$f":"IF(E27=\"\",\"\",VLOOKUP(E27,Actes!$A$2:$B$4,2,FALSE))","v":""},null,null,null,null,null,"€"]
[null,"\nPour acquit, le : \n",null,null,"\nSignature et cachet du psychothérapeute",null,null,"Total :",null,{"$f":"SUM(J18:J27)","v":0},{"$f":"SUM(K18:K27)","v":0},"€"]
[null,null,null,null,null,null,null,"Acompte à déduire :",null,null,null,"€"]
[null,null,null,null,null,null,null,"A PAYER :",null,{"$f":"J28-J29","v":0},null,"€"]
[]
[]
[]
[]
[]
[]
[]
[]
[]
[]
[]
[null,"En cas de lieu différent du cabinet, veuillez préciser :"]
[]
[]
[]
[null,"* en cas de prise en charge par l'assurance maladie-maternité"]
[null,"La loi du 1er août 2018 relative à la protection des données à caractère personnel, respectivement le Règlement général sur la protection des données (RGPD) sont appliqués. Pour l'exercice de vos droits (informations, modifications, suppression...) vous pouvez directement contacter votre professionnel de santé."]

{"sheet":"Remarque importante","index":1,"n_rows":9,"n_cols":1,"rows_kept":9,"cut":false,"hidden":false,"merged":[]}
["Conformément à l’article 5 du règlement grand-ducal du 12 février 2021 portant réglementation des relations entre la Caisse nationale de santé et le groupement représentatif de la profession de psychothérapeute au Grand-Duché de Luxembourg, le mémoire d’honoraires doit mentionner, entre autres, le lieu de délivrance des prestations."]
[]
["Le lieu de délivrance des prestations doit être indiqué comme suit dans la colonne « Lieu » du template mis à disposition par la CNS :"]
[]
["003 = domicile de l’assuré"]
["006 = établissement d’aides et de soins à séjour continu dans lequel l’assuré est domicilié"]
["009 = cabinet professionnel"]
[]
["Pour le lieu 006, une justification médicale doit obligatoirement être inscrite sur le mémoire d’honoraires. Toute prestation délivrée dans un lieu autre que ceux mentionnés dans la liste ci-dessus n’est pas opposable à l’assurance maladie-maternité. "]

{"sheet":"Actes","index":2,"n_rows":4,"n_cols":2,"rows_kept":4,"cut":false,"hidden":false,"merged":[]}
["Code","Libellé"]
["SP01","Séance de psychothérapie d’initiation"]
["SP02","Séance de psychothérapie de soutien"]
["SP03"," Séance de psychothérapie de soutien prolongée"]